Target
Nucleotide-binding oligomerization domain-containing protein 1
Ligand
BDBM50239705
Substrate
Meas. Tech.
ChEMBL_1666697 (CHEMBL4016493)
IC50
2360±n/a nM
Citation
 Wang, SYang, JLi, XLiu, ZWu, YSi, GTao, YZhao, NHu, XMa, YLiu, G Discovery of 1,4-Benzodiazepine-2,5-dione (BZD) Derivatives as Dual Nucleotide Binding Oligomerization Domain Containing 1/2 (NOD1/NOD2) Antagonists Sensitizing Paclitaxel (PTX) To Suppress Lewis Lung Carcinoma (LLC) Growth in Vivo. J Med Chem 60:5162-5192 (2017)  
Target
Name:
Nucleotide-binding oligomerization domain-containing protein 1
Synonyms:
CARD4 NOD1_HUMAN | nucleotide-binding oligomerization domain containing 1
Type:
Enzyme Catalytic Domain
Mol. Mass.:
107699.03
Organism:
Homo sapiens (Human)
Description:
gi_5174617
Residue:
953
  
Inhibitor
Name:
BDBM50239705
Synonyms:
CHEMBL4068672
Type:
Small organic molecule
Emp. Form.:
C32H37N5O6
Mol. Mass.:
587.6661
SMILES:
CCCNC(=O)CC[C@H]1NC(=O)c2cc(Oc3cccc(c3)N(C)C)c(NC(=O)COCc3ccccc3)cc2NC1=O
: