Target
D(2) dopamine receptor
Ligand
BDBM50001110
Substrate
Meas. Tech.
ChEBML_61130
Ki
5.8±n/a nM
Citation
 Ennis, MDBaze, MESmith, MWLawson, CFMcCall, RBLahti, RAPiercey, MF Novel indolodioxanes with antihypertensive effects: potent ligands for the 5-HT1A receptor. J Med Chem 35:3058-66 (1992)  
Target
Name:
D(2) dopamine receptor
Synonyms:
D(2) dopamine receptor DOPAMINE D2 Long DRD2 Dopamine D2 receptor Dopamine D2 receptor (D2R) Dopamine2-like | d2
Type:
Cell-surface receptors
Mol. Mass.:
50647.10
Organism:
Homo sapiens (Human)
Description:
P14416
Residue:
443
  
Inhibitor
Name:
BDBM50001110
Synonyms:
8-(4-Oxo-1-phenyl-1,3,8-triaza-spiro[4.5]dec-8-ylmethyl)-7,8-dihydro-3H-6,9-dioxa-3-aza-cyclopenta[a]naphthalene-2-carboxylic acid benzyl ester | CHEMBL318166
Type:
Small organic molecule
Emp. Form.:
C32H32N4O5
Mol. Mass.:
552.6203
SMILES:
O=C(OCc1ccccc1)c1cc2c3OC(CN4CCC5(CC4)N(CNC5=O)c4ccccc4)COc3ccc2[nH]1
: