Target
Coagulation factor IX
Ligand
BDBM50240484
Substrate
Meas. Tech.
ChEMBL_1668200 (CHEMBL4018088)
IC50
98±n/a nM
Citation
 Sakurada, IEndo, THikita, KHirabayashi, THosaka, YKato, YMaeda, YMatsumoto, SMizuno, TNagasue, HNishimura, TShimada, SShinozaki, MTaguchi, KTakeuchi, KYokoyama, THruza, AReichert, PZhang, TWood, HBNakao, KFurusako, S Discovery of novel aminobenzisoxazole derivatives as orally available factor IXa inhibitors. Bioorg Med Chem Lett 27:2622-2628 (2017)  
Target
Name:
Coagulation factor IX
Synonyms:
Christmas factor Coagulation factor IX/VIII Coagulation factor IXa heavy chain F9 Factor IX Factor IXa (fIXa) Plasma thromboplastin component
Type:
Enzyme
Mol. Mass.:
51768.83
Organism:
Homo sapiens (Human)
Description:
P00740
Residue:
461
  
Inhibitor
Name:
BDBM50240484
Synonyms:
CHEMBL4085322 | US9969724, Example 1
Type:
Small organic molecule
Emp. Form.:
C20H18ClN7O2
Mol. Mass.:
423.856
SMILES:
Nc1noc2c(cccc12)N1CCC(C1)NC(=O)c1ccc(cc1Cl)-n1cnnc1
: