Target
ELAV-like protein 1
Ligand
BDBM82867
Substrate
Meas. Tech.
ChEMBL_1668505 (CHEMBL4018393)
IC50
97400±n/a nM
Citation
 Nasti, RRossi, DAmadio, MPascale, AUnver, MYHirsch, AKHCollina, S Compounds Interfering with Embryonic Lethal Abnormal Vision (ELAV) Protein-RNA Complexes: An Avenue for Discovering New Drugs. J Med Chem 60:8257-8267 (2017)  
Target
Name:
ELAV-like protein 1
Synonyms:
ELAV1_HUMAN HUR | Hu-antigen R
Type:
PROTEIN
Mol. Mass.:
36102.56
Organism:
Homo sapiens (Human)
Description:
ChEMBL_654855
Residue:
326
  
Inhibitor
Name:
BDBM82867
Synonyms:
6-penta-1,3-diynyl-2-pyranone MLS000737691 cid_265580
Type:
Small organic molecule
Emp. Form.:
C10H6O2
Mol. Mass.:
158.1534
SMILES:
CC#CC#Cc1cccc(=O)o1
: