Target
Carbonic anhydrase 2
Ligand
BDBM50240905
Substrate
Meas. Tech.
ChEMBL_1669310 (CHEMBL4019198)
Kd
6100±n/a nM
Citation
 Chrysanthopoulos, PKMujumdar, PWoods, LADolezal, ORen, BPeat, TSPoulsen, SA Identification of a New Zinc Binding Chemotype by Fragment Screening. J Med Chem 60:7333-7349 (2017)  
Target
Name:
Carbonic anhydrase 2
Synonyms:
CA-II CAC Carbonate dehydratase II Carbonic anhydrase 2 (CA-II) Carbonic anhydrase C Carbonic anhydrase II (CA-II) Carbonic anhydrase II (hCA II) | Carbonic anhydrase isoenzyme II (hCA II)
Type:
Enzyme
Mol. Mass.:
29250.71
Organism:
Homo sapiens (Human)
Description:
P00918
Residue:
260
  
Inhibitor
Name:
BDBM50240905
Synonyms:
CHEMBL164652
Type:
Small organic molecule
Emp. Form.:
C11H11NO5
Mol. Mass.:
237.2087
SMILES:
COc1ccc(C2OC(=O)NC2=O)c(OC)c1
: