Target
D(2) dopamine receptor
Ligand
BDBM50001816
Substrate
Meas. Tech.
ChEBML_61406
IC50
410±n/a nM
Citation
 Andersen, KPerregaard, JArnt, JNielsen, JBBegtrup, M Selective, centrally acting serotonin 5-HT2 antagonists. 2. Substituted 3-(4-fluorophenyl)-1H-indoles. J Med Chem 35:4823-31 (1993)  
Target
Name:
D(2) dopamine receptor
Synonyms:
DOPAMINE D2 DOPAMINE D2 Short Dopamine D2 receptor Drd2
Type:
G Protein-Coupled Receptor (GPCR)
Mol. Mass.:
50931.60
Organism:
Rattus norvegicus (rat)
Description:
P61169
Residue:
444
  
Inhibitor
Name:
BDBM50001816
Synonyms:
1-(2-{4-[5-Chloro-3-(4-fluoro-phenyl)-indol-1-yl]-piperidin-1-yl}-ethyl)-imidazolidin-2-one | CHEMBL357019
Type:
Small organic molecule
Emp. Form.:
C24H26ClFN4O
Mol. Mass.:
440.941
SMILES:
Fc1ccc(cc1)-c1cn(C2CCN(CCN3CCNC3=O)CC2)c2ccc(Cl)cc12
: