Target
Substance-P receptor
Ligand
BDBM50002451
Substrate
Meas. Tech.
ChEBML_208650
IC50
1300±n/a nM
Citation
 Lawrence, KBVenepalli, BRAppell, KCGoswami, RLogan, METomczuk, BEYanni, JM Synthesis and substance P antagonist activity of naphthimidazolium derivatives. J Med Chem 35:1273-9 (1992)  
Target
Name:
Substance-P receptor
Synonyms:
NK-1 receptor NK1 Receptor Neurokinin 1 receptor SPR Tac1r Tacr1
Type:
G Protein-Coupled Receptor (GPCR)
Mol. Mass.:
46371.54
Organism:
Rattus norvegicus (rat)
Description:
Competition binding assays were carried out using membrane preparations from transfected CHO cells that constitutively expressed the rat NK1 receptor.
Residue:
407
  
Inhibitor
Name:
BDBM50002451
Synonyms:
5-Ethyl-4-[2-(3-ethyl-3H-benzothiazol-2-ylidene)-ethylidene]-2,3,4,5-tetrahydro-1H-naphtho[2',3':4,5]imidazo[1,2-a]pyridin-12-ylium; iodide | CHEMBL283990
Type:
Small organic molecule
Emp. Form.:
C28H28N3S
Mol. Mass.:
438.606
SMILES:
CCN1\C(Sc2ccccc12)=C/C=C1\CCC[n+]2c1n(CC)c1cc3ccccc3cc21
: