Target
Tyrosine-protein kinase ABL1
Ligand
BDBM50241992
Substrate
Meas. Tech.
ChEMBL_1671204 (CHEMBL4021233)
IC50
>30000±n/a nM
Citation
 Zhao, FZhang, LDHao, YChen, NBai, RWang, YJZhang, CCLi, GSHao, LJShi, CZhang, JMao, YFan, YXia, GXYu, JXLiu, YJ Identification of 3-substituted-6-(1-(1H-[1,2,3]triazolo[4,5-b]pyrazin-1-yl)ethyl)quinoline derivatives as highly potent and selective mesenchymal-epithelial transition factor (c-Met) inhibitors via metabolite profiling-based structural optimization. Eur J Med Chem 134:147-158 (2017)  
Target
Name:
Tyrosine-protein kinase ABL1
Synonyms:
ABL ABL1_HUMAN JTK7 Proto-oncogene tyrosine-protein kinase ABL1 Tyrosine-protein kinase ABL V-abl Abelson murine leukemia viral oncogene homolog 1 p150 | tyrosine-protein kinase ABL1 isoform a
Type:
Enzyme
Mol. Mass.:
122897.30
Organism:
Homo sapiens (Human)
Description:
P00519
Residue:
1130
  
Inhibitor
Name:
BDBM50241992
Synonyms:
CHEMBL4074262
Type:
Small organic molecule
Emp. Form.:
C24H21FN10O
Mol. Mass.:
484.4883
SMILES:
CC(c1cc2cc(cnc2cc1F)-c1cnn(C)c1)n1nnc2ncc(nc12)-c1cnn(CCO)c1
: