Target
Hepatocyte growth factor receptor
Ligand
BDBM50241992
Substrate
Meas. Tech.
ChEMBL_1671170 (CHEMBL4021199)
IC50
0.480±n/a nM
Citation
 Zhao, FZhang, LDHao, YChen, NBai, RWang, YJZhang, CCLi, GSHao, LJShi, CZhang, JMao, YFan, YXia, GXYu, JXLiu, YJ Identification of 3-substituted-6-(1-(1H-[1,2,3]triazolo[4,5-b]pyrazin-1-yl)ethyl)quinoline derivatives as highly potent and selective mesenchymal-epithelial transition factor (c-Met) inhibitors via metabolite profiling-based structural optimization. Eur J Med Chem 134:147-158 (2017)  
Target
Name:
Hepatocyte growth factor receptor
Synonyms:
Hepatocyte growth factor receptor Hepatocyte growth factor receptor (c-MET) MET Met proto-oncogene (hepatocyte growth factor receptor) Tyrosine-protein kinase Met (c-Met) c-Met kinase
Type:
Protein
Mol. Mass.:
155559.73
Organism:
Homo sapiens (Human)
Description:
P08581
Residue:
1390
  
Inhibitor
Name:
BDBM50241992
Synonyms:
CHEMBL4074262
Type:
Small organic molecule
Emp. Form.:
C24H21FN10O
Mol. Mass.:
484.4883
SMILES:
CC(c1cc2cc(cnc2cc1F)-c1cnn(C)c1)n1nnc2ncc(nc12)-c1cnn(CCO)c1
: