Target
Glycogen synthase kinase-3 beta
Ligand
BDBM50243389
Substrate
Meas. Tech.
ChEMBL_1672728 (CHEMBL4022757)
IC50
0.600000±n/a nM
Citation
 Wagman, ASBoyce, RSBrown, SPFang, EGoff, DJansen, JMLe, VPLevine, BHNg, SCNi, ZJNuss, JMPfister, KBRamurthy, SRenhowe, PARing, DBShu, WSubramanian, SZhou, XAShafer, CMHarrison, SDJohnson, KWBussiere, DE Synthesis, Binding Mode, and Antihyperglycemic Activity of Potent and Selective (5-Imidazol-2-yl-4-phenylpyrimidin-2-yl)[2-(2-pyridylamino)ethyl]amine Inhibitors of Glycogen Synthase Kinase 3. J Med Chem 60:8482-8514 (2017)  
Target
Name:
Glycogen synthase kinase-3 beta
Synonyms:
GSK-3 beta GSK3B Glycogen synthase kinase 3 beta (GSK3B) Glycogen synthase kinase-3 beta (GSK-3B) Glycogen synthase kinase-3 beta (GSK3B) Glycogen synthase kinase-3beta (GSK3B) | Serine/threonine-protein kinase GSK3B
Type:
Enzyme
Mol. Mass.:
46756.38
Organism:
Homo sapiens (Human)
Description:
P49841
Residue:
420
  
Inhibitor
Name:
BDBM50243389
Synonyms:
CHEMBL3185148
Type:
Small organic molecule
Emp. Form.:
C20H17Cl2N9O2
Mol. Mass.:
486.314
SMILES:
Nc1nc(NCCNc2ncc(c(n2)-c2ccc(Cl)cc2Cl)-n2ccnc2)ccc1[N+]([O-])=O
: