Target
Carbonic anhydrase 9
Ligand
BDBM50429899
Substrate
Meas. Tech.
ChEMBL_1673892 (CHEMBL4023921)
Kd
0.25±n/a nM
Citation
 Linkuvien?, VTalibov, VODanielson, UHMatulis, D Introduction of Intrinsic Kinetics of Protein-Ligand Interactions and Their Implications for Drug Design. J Med Chem 61:2292-2302 (2018)  
Target
Name:
Carbonic anhydrase 9
Synonyms:
CA-IX CAH9_HUMAN Carbonic anhydrase 9 (CA IX) Carbonic anhydrase 9 precursor Carbonic anhydrase IX (CAIX) Carbonic anhydrases; II & IX MN RCC-associated antigen G250
Type:
Enzyme
Mol. Mass.:
49669.03
Organism:
Homo sapiens (Human)
Description:
Catalytic domain of human cloned isozyme was used in the assay
Residue:
459
  
Inhibitor
Name:
BDBM50429899
Synonyms:
CHEMBL2333416
Type:
Small organic molecule
Emp. Form.:
C8H7F4NO3S2
Mol. Mass.:
305.27
SMILES:
NS(=O)(=O)c1c(F)c(F)c(SCCO)c(F)c1F
: