Target
5'-AMP-activated protein kinase catalytic subunit alpha-2/subunit beta-2/subunit gamma-2
Ligand
BDBM50246120
Substrate
Meas. Tech.
ChEMBL_1676500 (CHEMBL4026643)
EC50
23±n/a nM
Citation
 Lan, PRomero, FAWodka, DKassick, AJDang, QGibson, TCashion, DZhou, GChen, YZhang, XZhang, ALi, YTrujillo, MEShao, QWu, MXu, SHe, HMacKenna, DStaunton, JChapman, KTWeber, ASebhat, IKMakara, GM Hit-to-Lead Optimization and Discovery of 5-((5-([1,1'-Biphenyl]-4-yl)-6-chloro-1H-benzo[d]imidazol-2-yl)oxy)-2-methylbenzoic Acid (MK-3903): A Novel Class of Benzimidazole-Based Activators of AMP-Activated Protein Kinase. J Med Chem 60:9040-9052 (2017)  
Target
Name:
5'-AMP-activated protein kinase catalytic subunit alpha-2/subunit beta-2/subunit gamma-2
Synonyms:
AMP-activated protein kinase alpha-2/beta-2/gamma-2
Type:
Mol. Mass.:
Description:
ASSAY_ID of ChEMBL is 1676500
Components:
This complex has 3 components.
Component 1
Name:
5'-AMP-activated protein kinase catalytic subunit alpha-2
Synonyms:
AAPK2_HUMAN AMP-activated protein kinase, alpha-2 subunit AMPK subunit alpha-2 AMPK2 Hydroxymethylglutaryl-CoA reductase kinase | PRKAA2
Type:
Enzyme
Mol. Mass.:
62331.02
Organism:
Homo sapiens (Human)
Description:
P54646
Residue:
552
  
Component 2
Name:
5'-AMP-activated protein kinase subunit beta-2
Synonyms:
AAKB2_HUMAN AMPK subunit beta-2 | PRKAB2
Type:
PROTEIN
Mol. Mass.:
30301.35
Organism:
Homo sapiens (Human)
Description:
ChEMBL_107883
Residue:
272
  
Component 3
Name:
5'-AMP-activated protein kinase subunit gamma-2
Synonyms:
AAKG2_HUMAN AMPK subunit gamma-2 PRKAG2
Type:
PROTEIN
Mol. Mass.:
63086.61
Organism:
Homo sapiens
Description:
ChEMBL_117733
Residue:
569
  
Inhibitor
Name:
BDBM50246120
Synonyms:
CHEMBL4082745
Type:
Small organic molecule
Emp. Form.:
C27H19ClN2O3
Mol. Mass.:
454.904
SMILES:
Cc1ccc(Oc2nc3cc(c(Cl)cc3[nH]2)-c2ccc(cc2)-c2ccccc2)cc1C(O)=O
: