Target
Protein-arginine deiminase type-4
Ligand
BDBM454169
Substrate
Meas. Tech.
ChEMBL_1676557 (CHEMBL4026700)
Ki
180000±n/a nM
Citation
 Tejeda, EJCBello, AMWasilewski, EKoebel, ADunn, SKotra, LP Noncovalent Protein Arginine Deiminase (PAD) Inhibitors Are Efficacious in Animal Models of Multiple Sclerosis. J Med Chem 60:8876-8887 (2017)  
Target
Name:
Protein-arginine deiminase type-4
Synonyms:
PAD4 PADI4_HUMAN PDI5
Type:
Enzyme Catalytic Domain
Mol. Mass.:
74078.90
Organism:
Homo sapiens (Human)
Description:
gi_216548487
Residue:
663
  
Inhibitor
Name:
BDBM454169
Synonyms:
BDBM50246180 | US10716791, Code KP-302
Type:
Small organic molecule
Emp. Form.:
C20H23N5O2
Mol. Mass.:
365.4289
SMILES:
Cn1cccc1C(=O)N[C@@H](CCn1ccnc1)C(=O)NCc1ccccc1
: