Target
Protein-arginine deiminase type-4
Ligand
BDBM454164
Substrate
Meas. Tech.
ChEMBL_1676557 (CHEMBL4026700)
Ki
591000±n/a nM
Citation
 Tejeda, EJCBello, AMWasilewski, EKoebel, ADunn, SKotra, LP Noncovalent Protein Arginine Deiminase (PAD) Inhibitors Are Efficacious in Animal Models of Multiple Sclerosis. J Med Chem 60:8876-8887 (2017)  
Target
Name:
Protein-arginine deiminase type-4
Synonyms:
PAD4 PADI4_HUMAN PDI5
Type:
Enzyme Catalytic Domain
Mol. Mass.:
74078.90
Organism:
Homo sapiens (Human)
Description:
gi_216548487
Residue:
663
  
Inhibitor
Name:
BDBM454164
Synonyms:
BDBM50246192 | US10716791, Code KP-288
Type:
Small organic molecule
Emp. Form.:
C17H21N5O3
Mol. Mass.:
343.3803
SMILES:
CC(C)NC(=O)[C@H](CCn1cnc(CC#N)c1)NC(=O)c1ccco1
: