Target
ALK tyrosine kinase receptor
Ligand
BDBM50246514
Substrate
Meas. Tech.
ChEMBL_1676639 (CHEMBL4026782)
IC50
1483±n/a nM
Citation
 Mah, SPark, JHJung, HYAhn, KChoi, STae, HSJung, KHRho, JKLee, JCHong, SSHong, S Identification of 4-Phenoxyquinoline Based Inhibitors for L1196M Mutant of Anaplastic Lymphoma Kinase by Structure-Based Design. J Med Chem 60:9205-9221 (2017)  
Target
Name:
ALK tyrosine kinase receptor
Synonyms:
ALK ALK_HUMAN CD_antigen: CD246
Type:
Protein
Mol. Mass.:
176453.10
Organism:
Homo sapiens (Human)
Description:
Q9UM73
Residue:
1620
  
Inhibitor
Name:
BDBM50246514
Synonyms:
CHEMBL4100102
Type:
Small organic molecule
Emp. Form.:
C23H22FN5
Mol. Mass.:
387.4527
SMILES:
Fc1ccc(Nc2ccnc3cc(ccc23)-c2cnn(c2)C2CCNCC2)cc1
: