Target
DNA topoisomerase 1
Ligand
BDBM50247525
Substrate
Meas. Tech.
ChEMBL_1677827 (CHEMBL4027970)
EC50
82780±n/a nM
Citation
 Das, SKGhosh, APaul Chowdhuri, SHalder, NRehman, ISengupta, SSahoo, KCRath, HDas, BB Neutral Porphyrin Derivative Exerts Anticancer Activity by Targeting Cellular Topoisomerase I (Top1) and Promotes Apoptotic Cell Death without Stabilizing Top1-DNA Cleavage Complexes. J Med Chem 61:804-817 (2018)  
Target
Name:
DNA topoisomerase 1
Synonyms:
DNA topoisomerase I TOP1 | TOP1_HUMAN
Type:
Enzyme
Mol. Mass.:
90771.02
Organism:
Homo sapiens (Human)
Description:
P11387
Residue:
765
  
Inhibitor
Name:
BDBM50247525
Synonyms:
CHEMBL4070279
Type:
Small organic molecule
Emp. Form.:
C54H38N8
Mol. Mass.:
798.9331
SMILES:
Nc1ccc(cc1)-c1ccc(cc1)-c1c2ccc(n2)c(-c2ccc(cc2)-c2ccc(N)cc2)c2ccc([nH]2)c(-c2ccncc2)c2ccc(n2)c(-c2ccncc2)c2ccc1[nH]2
: