Target
DNA topoisomerase 1
Ligand
BDBM50247528
Substrate
Meas. Tech.
ChEMBL_1677828 (CHEMBL4027971)
EC50
381±n/a nM
Citation
 Das, SKGhosh, APaul Chowdhuri, SHalder, NRehman, ISengupta, SSahoo, KCRath, HDas, BB Neutral Porphyrin Derivative Exerts Anticancer Activity by Targeting Cellular Topoisomerase I (Top1) and Promotes Apoptotic Cell Death without Stabilizing Top1-DNA Cleavage Complexes. J Med Chem 61:804-817 (2018)  
Target
Name:
DNA topoisomerase 1
Synonyms:
DNA topoisomerase I TOP1 | TOP1_HUMAN
Type:
Enzyme
Mol. Mass.:
90771.02
Organism:
Homo sapiens (Human)
Description:
P11387
Residue:
765
  
Inhibitor
Name:
BDBM50247528
Synonyms:
CHEMBL4099866
Type:
Small organic molecule
Emp. Form.:
C50H40N6O4
Mol. Mass.:
788.8904
SMILES:
CN(C)c1ccc(cc1)-c1c2ccc(n2)c(-c2ccc(cc2)N(C)C)c2ccc([nH]2)c(-c2ccc(cc2)C(O)=O)c2ccc(n2)c(-c2ccc(cc2)C(O)=O)c2ccc1[nH]2
: