Target
DNA topoisomerase 1
Ligand
BDBM50247529
Substrate
Meas. Tech.
ChEMBL_1677828 (CHEMBL4027971)
EC50
>50000±n/a nM
Citation
 Das, SKGhosh, APaul Chowdhuri, SHalder, NRehman, ISengupta, SSahoo, KCRath, HDas, BB Neutral Porphyrin Derivative Exerts Anticancer Activity by Targeting Cellular Topoisomerase I (Top1) and Promotes Apoptotic Cell Death without Stabilizing Top1-DNA Cleavage Complexes. J Med Chem 61:804-817 (2018)  
Target
Name:
DNA topoisomerase 1
Synonyms:
DNA topoisomerase I TOP1 | TOP1_HUMAN
Type:
Enzyme
Mol. Mass.:
90771.02
Organism:
Homo sapiens (Human)
Description:
P11387
Residue:
765
  
Inhibitor
Name:
BDBM50247529
Synonyms:
CHEMBL4084530
Type:
Small organic molecule
Emp. Form.:
C40H26N8
Mol. Mass.:
618.688
SMILES:
c1cc2nc1c(-c1ccncc1)c1ccc([nH]1)c(-c1ccncc1)c1ccc(n1)c(-c1ccncc1)c1ccc([nH]1)c2-c1ccncc1
: