Target
DNA topoisomerase 1
Ligand
BDBM50247524
Substrate
Meas. Tech.
ChEMBL_1677828 (CHEMBL4027971)
EC50
>50000±n/a nM
Citation
 Das, SKGhosh, APaul Chowdhuri, SHalder, NRehman, ISengupta, SSahoo, KCRath, HDas, BB Neutral Porphyrin Derivative Exerts Anticancer Activity by Targeting Cellular Topoisomerase I (Top1) and Promotes Apoptotic Cell Death without Stabilizing Top1-DNA Cleavage Complexes. J Med Chem 61:804-817 (2018)  
Target
Name:
DNA topoisomerase 1
Synonyms:
DNA topoisomerase I TOP1 | TOP1_HUMAN
Type:
Enzyme
Mol. Mass.:
90771.02
Organism:
Homo sapiens (Human)
Description:
P11387
Residue:
765
  
Inhibitor
Name:
BDBM50247524
Synonyms:
CHEMBL4078465
Type:
Small organic molecule
Emp. Form.:
C42H26Br2N6
Mol. Mass.:
774.504
SMILES:
Brc1ccc(cc1)-c1c2ccc(n2)c(-c2ccc(Br)cc2)c2ccc([nH]2)c(-c2ccncc2)c2ccc(n2)c(-c2ccncc2)c2ccc1[nH]2
: