Target
Bile salt export pump
Ligand
BDBM50017657
Substrate
Meas. Tech.
ChEMBL_1678644 (CHEMBL4028921)
IC50
15700±n/a nM
Citation
 Morgan, REvan Staden, CJChen, YKalyanaraman, NKalanzi, JDunn, RTAfshari, CAHamadeh, HK A multifactorial approach to hepatobiliary transporter assessment enables improved therapeutic compound development. Toxicol Sci 136:216-41 (2013)  
Target
Name:
Bile salt export pump
Synonyms:
ABCB11 ATP-binding cassette sub-family B member 11 Bile Salt Export Pump, BSEP Bile salt export pump (BSEP)
Type:
Protein
Mol. Mass.:
146405.49
Organism:
Homo sapiens (Human)
Description:
O95342
Residue:
1321
  
Inhibitor
Name:
BDBM50017657
Synonyms:
1-(Diphenylmethyl)-4-(3-phenyl-2-propenyl)piperazine 1-Benzhydryl-4-cinnamylpiperazin CHEMBL43064 cinnarizine
Type:
Small organic molecule
Emp. Form.:
C26H28N2
Mol. Mass.:
368.5139
SMILES:
C(\C=C\c1ccccc1)N1CCN(CC1)C(c1ccccc1)c1ccccc1
: