Target
Thymidylate synthase
Ligand
BDBM50005322
Substrate
Meas. Tech.
ChEBML_208947
Ki
39±n/a nM
Citation
 Reich, SHFuhry, MANguyen, DPino, MJWelsh, KMWebber, SJanson, CAJordan, SRMatthews, DASmith, WW Design and synthesis of novel 6,7-imidazotetrahydroquinoline inhibitors of thymidylate synthase using iterative protein crystal structure analysis. J Med Chem 35:847-58 (1992)  
Target
Name:
Thymidylate synthase
Synonyms:
TS Thymidylate Synthase (TS) thyA
Type:
Mol. Mass.:
30487.86
Organism:
Escherichia coli
Description:
Residue:
264
  
Inhibitor
Name:
BDBM50005322
Synonyms:
CHEMBL353813 | [6-(2-Amino-1,6,7,8-tetrahydro-imidazo[4,5-g]quinolin-5-ylmethyl)-naphthalen-2-yl]-methanol
Type:
Small organic molecule
Emp. Form.:
C22H22N4O
Mol. Mass.:
358.4363
SMILES:
Nc1nc2cc3CCCN(Cc4ccc5cc(CO)ccc5c4)c3cc2[nH]1
: