Target
Thymidylate synthase
Ligand
BDBM50005324
Substrate
Meas. Tech.
ChEBML_208947
Ki
8±n/a nM
Citation
 Reich, SHFuhry, MANguyen, DPino, MJWelsh, KMWebber, SJanson, CAJordan, SRMatthews, DASmith, WW Design and synthesis of novel 6,7-imidazotetrahydroquinoline inhibitors of thymidylate synthase using iterative protein crystal structure analysis. J Med Chem 35:847-58 (1992)  
Target
Name:
Thymidylate synthase
Synonyms:
TS Thymidylate Synthase (TS) thyA
Type:
Mol. Mass.:
30487.86
Organism:
Escherichia coli
Description:
Residue:
264
  
Inhibitor
Name:
BDBM50005324
Synonyms:
4-[4-(2-Amino-1,6,7,8-tetrahydro-imidazo[4,5-g]quinolin-5-ylmethyl)-benzenesulfonyl]-phenol | CHEMBL169921
Type:
Small organic molecule
Emp. Form.:
C23H22N4O3S
Mol. Mass.:
434.511
SMILES:
Nc1nc2cc3CCCN(Cc4ccc(cc4)S(=O)(=O)c4ccc(O)cc4)c3cc2[nH]1
: