Target
Thymidylate synthase
Ligand
BDBM50005330
Substrate
Meas. Tech.
ChEBML_209652
Ki
13±n/a nM
Citation
 Reich, SHFuhry, MANguyen, DPino, MJWelsh, KMWebber, SJanson, CAJordan, SRMatthews, DASmith, WW Design and synthesis of novel 6,7-imidazotetrahydroquinoline inhibitors of thymidylate synthase using iterative protein crystal structure analysis. J Med Chem 35:847-58 (1992)  
Target
Name:
Thymidylate synthase
Synonyms:
TS TYMS Thymidylate synthase (TS) | Thymidylate synthase/GAR transformylase/AICAR transformylase
Type:
Enzyme
Mol. Mass.:
35718.07
Organism:
Homo sapiens (Human)
Description:
Residue:
313
  
Inhibitor
Name:
BDBM50005330
Synonyms:
5-(4-Benzenesulfonyl-benzyl)-5,6,7,8-tetrahydro-1H-imidazo[4,5-g]quinolin-2-ylamine CHEMBL301256
Type:
Small organic molecule
Emp. Form.:
C23H22N4O2S
Mol. Mass.:
418.511
SMILES:
Nc1nc2cc3CCCN(Cc4ccc(cc4)S(=O)(=O)c4ccccc4)c3cc2[nH]1
: