Target
Cyclic GMP-AMP synthase
Ligand
BDBM50250111
Substrate
Meas. Tech.
ChEMBL_1680904 (CHEMBL4031181)
IC50
17500±n/a nM
Citation
 Hall, JBrault, AVincent, FWeng, SWang, HDumlao, DAulabaugh, AAivazian, DCastro, DChen, MCulp, JDower, KGardner, JHawrylik, SGolenbock, DHepworth, DHorn, MJones, LJones, PLatz, ELi, JLin, LLLin, WLin, DLovering, FNiljanskul, NNistler, RPierce, BPlotnikova, OSchmitt, DShanker, SSmith, JSnyder, WSubashi, TTrujillo, JTyminski, EWang, GWong, JLefker, BDakin, LLeach, K Discovery of PF-06928215 as a high affinity inhibitor of cGAS enabled by a novel fluorescence polarization assay. PLoS ONE 12:1-16 (2017)  
Target
Name:
Cyclic GMP-AMP synthase
Synonyms:
2.7.7.86 CGAS Cyclic GMP-AMP synthase Mab-21 domain-containing protein 1 cGAMP synthase | h-cGAS
Type:
PROTEIN
Mol. Mass.:
58845.55
Organism:
Homo sapiens
Description:
ChEMBL_117333
Residue:
522
  
Inhibitor
Name:
BDBM50250111
Synonyms:
CHEMBL4084664
Type:
Small organic molecule
Emp. Form.:
C16H16N4O3
Mol. Mass.:
312.3232
SMILES:
C[C@@H](CO)NC(=O)c1cnn2c(O)cc(nc12)-c1ccccc1
: