Target
Sphingosine 1-phosphate receptor 5
Ligand
BDBM50250631
Substrate
Meas. Tech.
ChEMBL_1682043 (CHEMBL4032320)
Ki
0.574000±n/a nM
Citation
 Kurata, HKusumi, KOtsuki, KSuzuki, RKurono, MKomiya, THagiya, HMizuno, HShioya, HOno, TTakada, YMaeda, TMatsunaga, NKondo, TTominaga, SNunoya, KIKiyoshi, HKomeno, MNakade, SHabashita, H Discovery of a 1-Methyl-3,4-dihydronaphthalene-Based Sphingosine-1-Phosphate (S1P) Receptor Agonist Ceralifimod (ONO-4641). A S1P J Med Chem 60:9508-9530 (2017)  
Target
Name:
Sphingosine 1-phosphate receptor 5
Synonyms:
EDG8 S1P5 S1PR5_HUMAN Sphingosine 1-phosphate receptor Edg-8
Type:
G Protein-Coupled Receptor (GPCR)
Mol. Mass.:
41796.42
Organism:
Homo sapiens (Human)
Description:
Residue:
398
  
Inhibitor
Name:
BDBM50250631
Synonyms:
CHEMBL4093489
Type:
Small organic molecule
Emp. Form.:
C27H33NO4
Mol. Mass.:
435.5552
SMILES:
CCCc1ccc(COc2ccc3C(C)=C(CN4CC(C4)C(O)=O)CCc3c2)c(OC)c1
: