Target
Cyclin-A2/Cyclin-dependent kinase 2
Ligand
BDBM50250815
Substrate
Meas. Tech.
ChEMBL_1682206 (CHEMBL4032483)
IC50
4±n/a nM
Citation
 Singh, UChashoo, GKhan, SUMahajan, PNargotra, AMahajan, GSingh, ASharma, AMintoo, MJGuru, SKAruri, HThatikonda, TSahu, PChibber, PKumar, VMir, SABharate, SSMadishetti, SNandi, USingh, GMondhe, DMBhushan, SMalik, FMignani, SVishwakarma, RASingh, PP Design of Novel 3-Pyrimidinylazaindole CDK2/9 Inhibitors with Potent In Vitro and In Vivo Antitumor Efficacy in a Triple-Negative Breast Cancer Model. J Med Chem 60:9470-9489 (2017)  
Target
Name:
Cyclin-A2/Cyclin-dependent kinase 2
Synonyms:
CDK2-CyclinA CDK2/Cyclin A Cyclin A2/dependent kinase 2 Cyclin-Dependent Kinase 2 (CDK2A)
Type:
Protein Complex
Mol. Mass.:
Description:
Cdk2/Cyclin A kinase was purified from insect cells coinfected with Cyclin A/Cdk2 baculovirus.
Components:
This complex has 2 components.
Component 1
Name:
Cyclin-dependent kinase 2
Synonyms:
CDK2 CDK2_HUMAN Cell division protein kinase 2 Protein cereblon/Cyclin-dependent kinase 2 | p33 protein kinase
Type:
Enzyme Subunit
Mol. Mass.:
33938.17
Organism:
Homo sapiens (Human)
Description:
P24941
Residue:
298
  
Component 2
Name:
Cyclin-A2
Synonyms:
CCN1 CCNA1 CCNA2_HUMAN Cyclin-A
Type:
Enzyme Subunit
Mol. Mass.:
48550.19
Organism:
Homo sapiens (Human)
Description:
P20248
Residue:
432
  
Inhibitor
Name:
BDBM50250815
Synonyms:
CHEMBL4089950
Type:
Small organic molecule
Emp. Form.:
C17H12ClN5
Mol. Mass.:
321.764
SMILES:
Nc1nccc(n1)-c1c[nH]c2ncc(cc12)-c1ccc(Cl)cc1
: