Target
Sphingosine kinase 1
Ligand
BDBM50175277
Substrate
Meas. Tech.
ChEMBL_1683752 (CHEMBL4034231)
Ki
40±n/a nM
Citation
 Ohno, HHonda, MHamada, NMiyagaki, JIwata, AOtsuki, KMaruyama, TNakamura, SNakanishi, IInuki, SFujii, NOishi, S Identification of selective inhibitors of sphingosine kinases 1 and 2 through a structure-activity relationship study of 4-epi-jaspine B. Bioorg Med Chem 25:3046-3052 (2017)  
Target
Name:
Sphingosine kinase 1
Synonyms:
SK1 SPHK1 SPK Sphingosine kinase 1 (SPHK1) | Sphingosine kinase types 1 (SphK1)
Type:
Enzyme
Mol. Mass.:
42521.16
Organism:
Homo sapiens (Human)
Description:
Q9NYA1
Residue:
384
  
Inhibitor
Name:
BDBM50175277
Synonyms:
CHEMBL3809675
Type:
Small organic molecule
Emp. Form.:
C24H37ClN4O
Mol. Mass.:
433.03
SMILES:
Cl.CCCCCCCCCCCCc1ccc(cc1)-c1noc(n1)C1(CC1)C(N)=N
: