Target
Sphingosine kinase 1
Ligand
BDBM174110
Substrate
Meas. Tech.
ChEMBL_1683758 (CHEMBL4034237)
Ki
>10000±n/a nM
Citation
 Ohno, HHonda, MHamada, NMiyagaki, JIwata, AOtsuki, KMaruyama, TNakamura, SNakanishi, IInuki, SFujii, NOishi, S Identification of selective inhibitors of sphingosine kinases 1 and 2 through a structure-activity relationship study of 4-epi-jaspine B. Bioorg Med Chem 25:3046-3052 (2017)  
Target
Name:
Sphingosine kinase 1
Synonyms:
SK1 SPHK1 SPK Sphingosine kinase 1 (SPHK1) | Sphingosine kinase types 1 (SphK1)
Type:
Enzyme
Mol. Mass.:
42521.16
Organism:
Homo sapiens (Human)
Description:
Q9NYA1
Residue:
384
  
Inhibitor
Name:
BDBM174110
Synonyms:
(S)-2-(3-(4-octylphenyl)-1,2,4- oxadiazol-5-yl)azetidine-1- carboximidamide
Type:
Small organic molecule
Emp. Form.:
C20H29N5O
Mol. Mass.:
355.4772
SMILES:
CCCCCCCCc1ccc(cc1)-c1noc(n1)[C@@H]1CCN1C(N)=N
: