Target
Cytochrome P450 1A1
Ligand
BDBM67454
Substrate
Meas. Tech.
ChEMBL_1684860 (CHEMBL4035339)
IC50
5500±n/a nM
Citation
 Dutour, RPoirier, D Inhibitors of cytochrome P450 (CYP) 1B1. Eur J Med Chem 135:296-306 (2017)  
Target
Name:
Cytochrome P450 1A1
Synonyms:
CP1A1_HUMAN CYPIA1 Cytochrome P450 1A1 P450 form 6 P450-P1
Type:
Protein
Mol. Mass.:
58177.23
Organism:
Homo sapiens (Human)
Description:
P04798
Residue:
512
  
Inhibitor
Name:
BDBM67454
Synonyms:
1,2,4-trihydroxy-9,10-anthraquinone 1,2,4-tris(oxidanyl)anthracene-9,10-dione SMR001306802 hsp90_173 | purpurin
Type:
Small organic molecule
Emp. Form.:
C14H8O5
Mol. Mass.:
256.2103
SMILES:
Oc1cc(O)c2C(=O)c3ccccc3C(=O)c2c1O
: