Target
Cytochrome P450 1B1
Ligand
BDBM50049391
Substrate
Meas. Tech.
ChEMBL_1684847 (CHEMBL4035326)
IC50
3.0±n/a nM
Citation
 Dutour, RPoirier, D Inhibitors of cytochrome P450 (CYP) 1B1. Eur J Med Chem 135:296-306 (2017)  
Target
Name:
Cytochrome P450 1B1
Synonyms:
CP1B1_HUMAN CYPIB1 | Cytochrome P450 1B1 (CYP1B1)
Type:
PROTEIN
Mol. Mass.:
60861.81
Organism:
Homo sapiens (Human)
Description:
ChEMBL_1474523
Residue:
543
  
Inhibitor
Name:
BDBM50049391
Synonyms:
3,5,7-Trihydroxyflavone 3,5,7-trihydroxy-2-phenyl-4H-benzopyran-4-one CHEMBL309490 Galangin (15) cid_5281616 | norizalpinin
Type:
Small organic molecule
Emp. Form.:
C15H10O5
Mol. Mass.:
270.2369
SMILES:
Oc1cc(O)c2c(c1)oc(-c1ccccc1)c(O)c2=O
: