Target
Casein kinase II subunit alpha
Ligand
BDBM50252630
Substrate
Meas. Tech.
ChEBML_1685041
Kd
58000±n/a nM
Citation
 De Fusco, CBrear, PIegre, JGeorgiou, KHSore, HFHyvönen, MSpring, DR A fragment-based approach leading to the discovery of a novel binding site and the selective CK2 inhibitor CAM4066. Bioorg Med Chem 25:3471-3482 (2017)  
Target
Name:
Casein kinase II subunit alpha
Synonyms:
CK II CK2- alpha CSK21_HUMAN Casein kinase 2 Casein kinase II alpha/beta Casein kinase II subunit alpha (CK2A1) Casein kinase II subunit alpha (CK2a V66A) Casein kinase II subunit alpha (CK2a)
Type:
Enzyme
Mol. Mass.:
45151.12
Organism:
Homo sapiens (Human)
Description:
P68400
Residue:
391
  
Inhibitor
Name:
BDBM50252630
Synonyms:
CHEMBL1161012
Type:
Small organic molecule
Emp. Form.:
C8H8O3
Mol. Mass.:
152.1473
SMILES:
Cc1ccc(O)c(c1)C(O)=O
: