Target
Cytosolic endo-beta-N-acetylglucosaminidase
Ligand
BDBM50402289
Substrate
Meas. Tech.
ChEBML_1685304
IC50
20000±n/a nM
Citation
 Bi, YMight, MVankayalapati, HKuberan, B Repurposing of Proton Pump Inhibitors as first identified small molecule inhibitors of endo-?-N-acetylglucosaminidase (ENGase) for the treatment of NGLY1 deficiency, a rare genetic disease. Bioorg Med Chem Lett 27:2962-2966 (2017)  
Target
Name:
Cytosolic endo-beta-N-acetylglucosaminidase
Synonyms:
ENASE_HUMAN Endo-beta-N-acetylglucosaminidase
Type:
PROTEIN
Mol. Mass.:
83989.32
Organism:
Homo sapiens (Human)
Description:
ChEMBL_467019
Residue:
743
  
Inhibitor
Name:
BDBM50402289
Synonyms:
TENATOPRAZOLE
Type:
Small organic molecule
Emp. Form.:
C16H18N4O3S
Mol. Mass.:
346.404
SMILES:
COc1ccc2[nH]c(nc2n1)S(=O)Cc1ncc(C)c(OC)c1C
: