Target
3 beta-hydroxysteroid dehydrogenase/Delta 5-->4-isomerase type 2
Ligand
BDBM107664
Substrate
Meas. Tech.
ChEBML_1685727
IC50
>10000±n/a nM
Citation
 Zhuang, LTice, CMXu, ZZhao, WCacatian, SYe, YJSingh, SBLindblom, PMcKeever, BMKrosky, PMZhao, YLala, DKruk, BAMeng, SHoward, LJohnson, JABukhtiyarov, YPanemangalore, RGuo, JGuo, RHimmelsbach, FHamilton, BSchuler-Metz, ASchauerte, HGregg, RMcGeehan, GMLeftheris, KClaremon, DA Discovery of BI 135585, an in vivo efficacious oxazinanone-based 11? hydroxysteroid dehydrogenase type 1 inhibitor. Bioorg Med Chem 25:3649-3657 (2017)  
Target
Name:
3 beta-hydroxysteroid dehydrogenase/Delta 5-->4-isomerase type 2
Synonyms:
3-beta-hydroxysteroid dehydrogenase/delta 5-->4-isomerase type II HSD3B2 | HSDB3B
Type:
PROTEIN
Mol. Mass.:
42057.22
Organism:
Homo sapiens (Human)
Description:
ChEMBL_768821
Residue:
372
  
Inhibitor
Name:
BDBM107664
Synonyms:
US8575157, 48
Type:
Small organic molecule
Emp. Form.:
C28H32N2O4
Mol. Mass.:
460.5647
SMILES:
C[C@H](N1CC[C@@](CC(C)(C)O)(OC1=O)c1ccccc1)c1ccc(cc1)-c1ccn(C)c(=O)c1
: