Target
Rho-associated protein kinase 1
Ligand
BDBM50253670
Substrate
Meas. Tech.
ChEBML_1685778
IC50
370±n/a nM
Citation
 Kurasawa, OHomma, MOguro, YMiyazaki, TMori, KUchiyama, NIwai, KOhashi, AHara, HYoshida, SCho, N 2-Aminomethylthieno[3,2-d]pyrimidin-4(3H)-ones bearing 3-methylpyrazole hinge binding moiety: Highly potent, selective, and time-dependent inhibitors of Cdc7 kinase. Bioorg Med Chem 25:3658-3670 (2017)  
Target
Name:
Rho-associated protein kinase 1
Synonyms:
ROCK-I ROCK1_HUMAN Rho-associated protein kinase Rho-associated, coiled-coil-containing protein kinase 1 Rho-kinase (ROCK I) p160 ROCK-1 | p160ROCK
Type:
Serine/threonine-protein kinase
Mol. Mass.:
158156.77
Organism:
Homo sapiens (Human)
Description:
Q13464
Residue:
1354
  
Inhibitor
Name:
BDBM50253670
Synonyms:
CHEMBL4096077
Type:
Small organic molecule
Emp. Form.:
C15H13N5OS
Mol. Mass.:
311.362
SMILES:
Cc1n[nH]cc1-c1cc2nc(Cn3cccc3)[nH]c(=O)c2s1
: