Target
Adenosine receptor A1
Ligand
BDBM50007847
Substrate
Meas. Tech.
ChEBML_27567
Ki
130±n/a nM
Citation
 Katsushima, TNieves, LWells, JN Structure-activity relationships of 8-cycloalkyl-1,3-dipropylxanthines as antagonists of adenosine receptors. J Med Chem 33:1906-10 (1990)  
Target
Name:
Adenosine receptor A1
Synonyms:
A1 adenosine receptor (hA1) AA1R_HUMAN ADORA1 Adenosine A1-receptor Adenosine receptor A1 (hA1) | Adenosine transporter (AdT)
Type:
G Protein-Coupled Receptor (GPCR)
Mol. Mass.:
36520.92
Organism:
Homo sapiens (Human)
Description:
P30542
Residue:
326
  
Inhibitor
Name:
BDBM50007847
Synonyms:
4-(2,6-Dioxo-1,3-dipropyl-2,3,6,7-tetrahydro-1H-purin-8-yl)-cyclohexanecarboxylic acid methyl ester | CHEMBL299699
Type:
Small organic molecule
Emp. Form.:
C19H28N4O4
Mol. Mass.:
376.45
SMILES:
CCCn1c2nc([nH]c2c(=O)n(CCC)c1=O)C1CCC(CC1)C(=O)OC
: