Target
Retinal rod rhodopsin-sensitive cGMP 3',5'-cyclic phosphodiesterase subunit delta
Ligand
BDBM50256247
Substrate
Meas. Tech.
ChEBML_1687628
Kd
9.8±n/a nM
Citation
 Chen, LZhuang, CLu, JJiang, YSheng, C Discovery of Novel KRAS-PDE? Inhibitors by Fragment-Based Drug Design. J Med Chem 61:2604-2610 (2018)  
Target
Name:
Retinal rod rhodopsin-sensitive cGMP 3',5'-cyclic phosphodiesterase subunit delta
Synonyms:
3',5'-cyclic phosphodiesterase PDE6D PDED Retinal rod rhodopsin-sensitive cGMP 3',5'-cyclic phosphodiesterase subunit delta
Type:
PROTEIN
Mol. Mass.:
17418.30
Organism:
Homo sapiens (Human)
Description:
ChEMBL_105761
Residue:
150
  
Inhibitor
Name:
BDBM50256247
Synonyms:
CHEMBL4077104
Type:
Small organic molecule
Emp. Form.:
C36H30FN5O3
Mol. Mass.:
599.6535
SMILES:
COc1ccc2C(=O)N(CCOc3ccc(cc3)-c3nc4ccccc4n3Cc3ccncc3)C(Nc2c1)c1ccccc1F
: