Target
Muscarinic acetylcholine receptor M1
Ligand
BDBM50008074
Substrate
Meas. Tech.
ChEBML_138791
IC50
5150.0±n/a nM
Citation
 Shapiro, GFloersheim, PBoelsterli, JAmstutz, RBolliger, GGammenthaler, HGmelin, GSupavilai, PWalkinshaw, M Muscarinic activity of the thiolactone, lactam, lactol, and thiolactol analogues of pilocarpine and a hypothetical model for the binding of agonists to the m1 receptor. J Med Chem 35:15-27 (1992)  
Target
Name:
Muscarinic acetylcholine receptor M1
Synonyms:
ACM1_RAT Chrm-1 cholinergic receptor, muscarinic 1
Type:
Enzyme Catalytic Domain
Mol. Mass.:
51390.46
Organism:
RAT
Description:
P08482
Residue:
460
  
Inhibitor
Name:
BDBM50008074
Synonyms:
3-Ethyl-4-(3-methyl-3H-imidazol-4-ylmethyl)-pyrrolidin-2-one | CHEMBL90409
Type:
Small organic molecule
Emp. Form.:
C11H17N3O
Mol. Mass.:
207.2722
SMILES:
CC[C@H]1[C@@H](Cc2cncn2C)CNC1=O
: