Target
Metabotropic glutamate receptor 5
Ligand
BDBM50257064
Substrate
Meas. Tech.
ChEMBL_1688689 (CHEMBL4039259)
Ki
4.4±n/a nM
Citation
 Felts, ASRodriguez, ALBlobaum, ALMorrison, RDBates, BSThompson Gray, ARook, JMTantawy, MNByers, FWChang, SVenable, DFLuscombe, VBTamagnan, GDNiswender, CMDaniels, JSJones, CKConn, PJLindsley, CWEmmitte, KA Discovery of N-(5-Fluoropyridin-2-yl)-6-methyl-4-(pyrimidin-5-yloxy)picolinamide (VU0424238): A Novel Negative Allosteric Modulator of Metabotropic Glutamate Receptor Subtype 5 Selected for Clinical Evaluation. J Med Chem 60:5072-5085 (2017)  
Target
Name:
Metabotropic glutamate receptor 5
Synonyms:
GRM5_RAT Grm5 Mglur5 metabotropic glutamate 5/1-C metabotropic glutamate 5a
Type:
Enzyme
Mol. Mass.:
131900.14
Organism:
Rattus norvegicus (Rat)
Description:
P31424
Residue:
1203
  
Inhibitor
Name:
BDBM50257064
Synonyms:
CHEMBL2386850
Type:
Small organic molecule
Emp. Form.:
C16H12FN5O2
Mol. Mass.:
325.2972
SMILES:
Cc1cc(Oc2cncnc2)cc(n1)C(=O)Nc1ccc(F)cn1
: