Target
Vascular endothelial growth factor receptor 1
Ligand
BDBM50257253
Substrate
Meas. Tech.
ChEBML_1689672
IC50
56000±n/a nM
Citation
 Wang, LZhou, LReille-Seroussi, MGagey-Eilstein, NBroussy, SZhang, TJi, LVidal, MLiu, WQ Identification of Peptidic Antagonists of Vascular Endothelial Growth Factor Receptor 1 by Scanning the Binding Epitopes of Its Ligands. J Med Chem 60:6598-6606 (2017)  
Target
Name:
Vascular endothelial growth factor receptor 1
Synonyms:
FLT FRT Fms-like tyrosine kinase 1 Tyrosine-protein kinase FRT VEGFR-1 VGFR1_HUMAN Vascular endothelial growth factor receptor 1 (FLT1) Vascular endothelial growth factor receptor 1 and 2 (Flt-1 and KDR) Vascular permeability factor receptor vascular endothelial growth factor/vascular permeability factor receptor
Type:
Receptor Tyrosine Kinase
Mol. Mass.:
150800.23
Organism:
Homo sapiens (Human)
Description:
P17948
Residue:
1338
  
Inhibitor
Name:
BDBM50257253
Synonyms:
CHEMBL4077087
Type:
Small organic molecule
Emp. Form.:
C60H88N16O23S3
Mol. Mass.:
1497.629
SMILES:
CSCC[C@@H]1NC(=O)[C@H](Cc2cnc[nH]2)NC(=O)[C@H](CCC(O)=O)NC(=O)[C@@H](NC(=O)[C@H](CCC(O)=O)NC(=O)[C@H](CO)NC(=O)[C@@H]2CCCN2C(=O)[C@H](Cc2ccc(O)cc2)NC(=O)[C@H](CCC(O)=O)NC(=O)[C@H](CO)NC(=O)[C@@H](N)CSSC[C@H](NC1=O)C(=O)N[C@@H](CO)C(N)=O)C(C)C
: