Target
Vascular endothelial growth factor receptor 1
Ligand
BDBM50257256
Substrate
Meas. Tech.
ChEBML_1689672
IC50
10400±n/a nM
Citation
 Wang, LZhou, LReille-Seroussi, MGagey-Eilstein, NBroussy, SZhang, TJi, LVidal, MLiu, WQ Identification of Peptidic Antagonists of Vascular Endothelial Growth Factor Receptor 1 by Scanning the Binding Epitopes of Its Ligands. J Med Chem 60:6598-6606 (2017)  
Target
Name:
Vascular endothelial growth factor receptor 1
Synonyms:
FLT FRT Fms-like tyrosine kinase 1 Tyrosine-protein kinase FRT VEGFR-1 VGFR1_HUMAN Vascular endothelial growth factor receptor 1 (FLT1) Vascular endothelial growth factor receptor 1 and 2 (Flt-1 and KDR) Vascular permeability factor receptor vascular endothelial growth factor/vascular permeability factor receptor
Type:
Receptor Tyrosine Kinase
Mol. Mass.:
150800.23
Organism:
Homo sapiens (Human)
Description:
P17948
Residue:
1338
  
Inhibitor
Name:
BDBM50257256
Synonyms:
CHEMBL4092853
Type:
Small organic molecule
Emp. Form.:
C74H127N19O22S3
Mol. Mass.:
1731.109
SMILES:
CSCC[C@@H]1NC(=O)[C@H](CC(C)C)NC(=O)[C@H](CCC(O)=O)NC(=O)[C@@H](NC(=O)[C@@H](NC(=O)[C@H](CSSC[C@H](NC(=O)[C@@H]2CCCN2C(=O)[C@@H](NC(=O)[C@H](CC(C)C)NC(=O)[C@H](CCC(N)=O)NC(=O)[C@H](CCCCN)NC(=O)[C@H](C)NC(=O)[C@@H](NC(=O)[C@@H](NC(=O)CNC1=O)[C@@H](C)O)C(C)C)C(C)C)C(N)=O)NC(C)=O)[C@@H](C)O)C(C)C
: