Target
Vascular endothelial growth factor receptor 1
Ligand
BDBM50257257
Substrate
Meas. Tech.
ChEBML_1689672
IC50
75100±n/a nM
Citation
 Wang, LZhou, LReille-Seroussi, MGagey-Eilstein, NBroussy, SZhang, TJi, LVidal, MLiu, WQ Identification of Peptidic Antagonists of Vascular Endothelial Growth Factor Receptor 1 by Scanning the Binding Epitopes of Its Ligands. J Med Chem 60:6598-6606 (2017)  
Target
Name:
Vascular endothelial growth factor receptor 1
Synonyms:
FLT FRT Fms-like tyrosine kinase 1 Tyrosine-protein kinase FRT VEGFR-1 VGFR1_HUMAN Vascular endothelial growth factor receptor 1 (FLT1) Vascular endothelial growth factor receptor 1 and 2 (Flt-1 and KDR) Vascular permeability factor receptor vascular endothelial growth factor/vascular permeability factor receptor
Type:
Receptor Tyrosine Kinase
Mol. Mass.:
150800.23
Organism:
Homo sapiens (Human)
Description:
P17948
Residue:
1338
  
Inhibitor
Name:
BDBM50257257
Synonyms:
CHEMBL4071072
Type:
Small organic molecule
Emp. Form.:
C78H115N17O26
Mol. Mass.:
1706.846
SMILES:
CC[C@H](C)[C@@H]1NC(=O)[C@H](Cc2ccc(O)cc2)NC(=O)[C@H](CCC(O)=O)NC(=O)[C@@H](NC(=O)[C@H](CCC(O)=O)NC(=O)[C@H](CC(O)=O)NC(=O)[C@@H]2CCCN2C(=O)[C@H](Cc2ccc(O)cc2)NC(=O)[C@H](CCC(O)=O)NC(=O)[C@H](CCC(N)=O)NC(=O)[C@H](CCCCNC(=O)CC[C@H](NC1=O)C(=O)N[C@@H](CCCCN)C(N)=O)NC(C)=O)[C@@H](C)CC
: