Target
Vascular endothelial growth factor receptor 1
Ligand
BDBM50257258
Substrate
Meas. Tech.
ChEBML_1689672
IC50
50400±n/a nM
Citation
 Wang, LZhou, LReille-Seroussi, MGagey-Eilstein, NBroussy, SZhang, TJi, LVidal, MLiu, WQ Identification of Peptidic Antagonists of Vascular Endothelial Growth Factor Receptor 1 by Scanning the Binding Epitopes of Its Ligands. J Med Chem 60:6598-6606 (2017)  
Target
Name:
Vascular endothelial growth factor receptor 1
Synonyms:
FLT FRT Fms-like tyrosine kinase 1 Tyrosine-protein kinase FRT VEGFR-1 VGFR1_HUMAN Vascular endothelial growth factor receptor 1 (FLT1) Vascular endothelial growth factor receptor 1 and 2 (Flt-1 and KDR) Vascular permeability factor receptor vascular endothelial growth factor/vascular permeability factor receptor
Type:
Receptor Tyrosine Kinase
Mol. Mass.:
150800.23
Organism:
Homo sapiens (Human)
Description:
P17948
Residue:
1338
  
Inhibitor
Name:
BDBM50257258
Synonyms:
CHEMBL4062433
Type:
Small organic molecule
Emp. Form.:
C71H104N16O24S2
Mol. Mass.:
1629.808
SMILES:
CC[C@H](C)[C@@H]1NC(=O)[C@H](CCC(O)=O)NC(=O)[C@H](CC(O)=O)NC(=O)[C@@H]2CCCN2C(=O)[C@H](Cc2ccc(O)cc2)NC(=O)[C@H](CCC(O)=O)NC(=O)[C@H](CCC(N)=O)NC(=O)[C@@H](N)CSSC[C@H](NC(=O)[C@@H](NC(=O)[C@H](Cc2ccc(O)cc2)NC(=O)[C@H](CCC(O)=O)NC1=O)[C@@H](C)CC)C(=O)N[C@@H](CCCCN)C(N)=O
: