Target
Neprilysin
Ligand
BDBM50008598
Substrate
Meas. Tech.
ChEBML_64516
IC50
52±n/a nM
Citation
 Mimura, TNakamura, YNishino, JSawayama, TKomiya, TDeguchi, TKita, ANakamura, HMatsumoto, J A novel class of enkephalinase inhibitors containing a C-terminal sulfo group. J Med Chem 35:602-8 (1992)  
Target
Name:
Neprilysin
Synonyms:
Mme Neprilysin Neutral endopeptidase 24.11
Type:
Protein
Mol. Mass.:
85789.59
Organism:
Rattus norvegicus (Rat)
Description:
P07861
Residue:
750
  
Inhibitor
Name:
BDBM50008598
Synonyms:
CHEMBL422526 | Sodium; 4-(3-biphenyl-4-yl-2-mercaptomethyl-propionylamino)-benzenesulfonate (H2O)
Type:
Small organic molecule
Emp. Form.:
C22H20NO4S2
Mol. Mass.:
426.529
SMILES:
[O-]S(=O)(=O)c1ccc(NC(=O)C(CS)Cc2ccc(cc2)-c2ccccc2)cc1
: