Target
Neprilysin
Ligand
BDBM50008602
Substrate
Meas. Tech.
ChEBML_64516
IC50
1.1±n/a nM
Citation
 Mimura, TNakamura, YNishino, JSawayama, TKomiya, TDeguchi, TKita, ANakamura, HMatsumoto, J A novel class of enkephalinase inhibitors containing a C-terminal sulfo group. J Med Chem 35:602-8 (1992)  
Target
Name:
Neprilysin
Synonyms:
Mme Neprilysin Neutral endopeptidase 24.11
Type:
Protein
Mol. Mass.:
85789.59
Organism:
Rattus norvegicus (Rat)
Description:
P07861
Residue:
750
  
Inhibitor
Name:
BDBM50008602
Synonyms:
CHEMBL435444 | Sodium; 4-(2-mercaptomethyl-3-p-tolyl-propionylamino)-benzenesulfonate (0.75H2O)
Type:
Small organic molecule
Emp. Form.:
C17H18NO4S2
Mol. Mass.:
364.46
SMILES:
Cc1ccc(CC(CS)C(=O)Nc2ccc(cc2)S([O-])(=O)=O)cc1
: