Target
Angiotensin-converting enzyme
Ligand
BDBM50008605
Substrate
Meas. Tech.
ChEMBL_34795 (CHEMBL644411)
IC50
720000±n/a nM
Citation
 Mimura, TNakamura, YNishino, JSawayama, TKomiya, TDeguchi, TKita, ANakamura, HMatsumoto, J A novel class of enkephalinase inhibitors containing a C-terminal sulfo group. J Med Chem 35:602-8 (1992)  
Target
Name:
Angiotensin-converting enzyme
Synonyms:
3.2.1.- ACE Angiotensin-converting enzyme, soluble form DCP1 Kininase II
Type:
Mol. Mass.:
150405.15
Organism:
Oryctolagus cuniculus
Description:
Residue:
1310
  
Inhibitor
Name:
BDBM50008605
Synonyms:
CHEMBL157663 | Sodium; 2-(2-mercaptomethyl-3-phenyl-propionylamino)-ethanesulfonate(H2O)
Type:
Small organic molecule
Emp. Form.:
C12H16NO4S2
Mol. Mass.:
302.39
SMILES:
[O-]S(=O)(=O)CCNC(=O)C(CS)Cc1ccccc1
: