Target
Neprilysin
Ligand
BDBM50008611
Substrate
Meas. Tech.
ChEBML_64516
IC50
37±n/a nM
Citation
 Mimura, TNakamura, YNishino, JSawayama, TKomiya, TDeguchi, TKita, ANakamura, HMatsumoto, J A novel class of enkephalinase inhibitors containing a C-terminal sulfo group. J Med Chem 35:602-8 (1992)  
Target
Name:
Neprilysin
Synonyms:
Mme Neprilysin Neutral endopeptidase 24.11
Type:
Protein
Mol. Mass.:
85789.59
Organism:
Rattus norvegicus (Rat)
Description:
P07861
Residue:
750
  
Inhibitor
Name:
BDBM50008611
Synonyms:
CHEMBL422165 | Sodium; 2-[3-(4-dimethylamino-phenyl)-2-mercaptomethyl-propionylamino]-ethanesulfonate (0.25H2O)
Type:
Small organic molecule
Emp. Form.:
C14H21N2O4S2
Mol. Mass.:
345.458
SMILES:
CN(C)c1ccc(CC(CS)C(=O)NCCS([O-])(=O)=O)cc1
: