Target
Neprilysin
Ligand
BDBM50008612
Substrate
Meas. Tech.
ChEBML_64516
IC50
0.270000±n/a nM
Citation
 Mimura, TNakamura, YNishino, JSawayama, TKomiya, TDeguchi, TKita, ANakamura, HMatsumoto, J A novel class of enkephalinase inhibitors containing a C-terminal sulfo group. J Med Chem 35:602-8 (1992)  
Target
Name:
Neprilysin
Synonyms:
Mme Neprilysin Neutral endopeptidase 24.11
Type:
Protein
Mol. Mass.:
85789.59
Organism:
Rattus norvegicus (Rat)
Description:
P07861
Residue:
750
  
Inhibitor
Name:
BDBM50008612
Synonyms:
CHEMBL154588 | Sodium; 3-(2-mercaptomethyl-3-phenyl-propionylamino)-benzenesulfonate (1.5H2O)
Type:
Small organic molecule
Emp. Form.:
C16H16NO4S2
Mol. Mass.:
350.433
SMILES:
[O-]S(=O)(=O)c1cccc(NC(=O)C(CS)Cc2ccccc2)c1
: