Target
Angiotensin-converting enzyme
Ligand
BDBM50008590
Substrate
Meas. Tech.
ChEMBL_34795 (CHEMBL644411)
IC50
120000±n/a nM
Citation
 Mimura, TNakamura, YNishino, JSawayama, TKomiya, TDeguchi, TKita, ANakamura, HMatsumoto, J A novel class of enkephalinase inhibitors containing a C-terminal sulfo group. J Med Chem 35:602-8 (1992)  
Target
Name:
Angiotensin-converting enzyme
Synonyms:
3.2.1.- ACE Angiotensin-converting enzyme, soluble form DCP1 Kininase II
Type:
Mol. Mass.:
150405.15
Organism:
Oryctolagus cuniculus
Description:
Residue:
1310
  
Inhibitor
Name:
BDBM50008590
Synonyms:
CHEMBL154774 | Sodium; 4-(2-mercaptomethyl-3-phenyl-propionylamino)-benzenesulfonate (H2O)
Type:
Small organic molecule
Emp. Form.:
C16H16NO4S2
Mol. Mass.:
350.433
SMILES:
[O-]S(=O)(=O)c1ccc(NC(=O)C(CS)Cc2ccccc2)cc1
: