Target
Neprilysin
Ligand
BDBM50008620
Substrate
Meas. Tech.
ChEBML_64516
IC50
5.4±n/a nM
Citation
 Mimura, TNakamura, YNishino, JSawayama, TKomiya, TDeguchi, TKita, ANakamura, HMatsumoto, J A novel class of enkephalinase inhibitors containing a C-terminal sulfo group. J Med Chem 35:602-8 (1992)  
Target
Name:
Neprilysin
Synonyms:
Mme Neprilysin Neutral endopeptidase 24.11
Type:
Protein
Mol. Mass.:
85789.59
Organism:
Rattus norvegicus (Rat)
Description:
P07861
Residue:
750
  
Inhibitor
Name:
BDBM50008620
Synonyms:
CHEMBL156012 | Sodium; 3-(2-mercaptomethyl-3-phenyl-propionylamino)-propane-1-sulfonate
Type:
Small organic molecule
Emp. Form.:
C13H18NO4S2
Mol. Mass.:
316.417
SMILES:
[O-]S(=O)(=O)CCCNC(=O)C(CS)Cc1ccccc1
: