Target
Neprilysin
Ligand
BDBM50008622
Substrate
Meas. Tech.
ChEBML_64516
IC50
5±n/a nM
Citation
 Mimura, TNakamura, YNishino, JSawayama, TKomiya, TDeguchi, TKita, ANakamura, HMatsumoto, J A novel class of enkephalinase inhibitors containing a C-terminal sulfo group. J Med Chem 35:602-8 (1992)  
Target
Name:
Neprilysin
Synonyms:
Mme Neprilysin Neutral endopeptidase 24.11
Type:
Protein
Mol. Mass.:
85789.59
Organism:
Rattus norvegicus (Rat)
Description:
P07861
Residue:
750
  
Inhibitor
Name:
BDBM50008622
Synonyms:
CHEMBL158345 | Sodium; 4-[3-(4-fluoro-phenyl)-2-mercaptomethyl-propionylamino]-benzenesulfonate (0.5H2O)
Type:
Small organic molecule
Emp. Form.:
C16H15FNO4S2
Mol. Mass.:
368.424
SMILES:
[O-]S(=O)(=O)c1ccc(NC(=O)C(CS)Cc2ccc(F)cc2)cc1
: